tflite
Functional Tests
Summary: Some tests failed.
nb test passed | nb test failed | nb test skipped | health score |
---|---|---|---|
2 | 1 | 0 | 0.67 |
Here is the summary of all the tests pefromed :
Model Name | Test | Pipeline | ID |
---|---|---|---|
keypoint_classifier.tflite | PASSED | SUCCESS | 1611 |
movenet_singlepose_lightning_192_int8.tflite | FAILED | FAILED | 1612 |
mnist-7.onnx | PASSED | FAILED | 1613 |